[OpenVPN home] [Date Prev] [Date Index] [Date Next]
[OpenVPN mailing lists] [Thread Prev] [Thread Index] [Thread Next]
Google
 
Web openvpn.net

[Openvpn-users] build Openvpn 2.1RC4 on Windows failure



Hi,

I'm trying to build Openvpn-2.1RC4 on Windows and it failed.

C:\msys\1.0\src\openvpn-2.1_rc4>make -f makefile.w32
gcc -g -O2 -Wall -Wno-unused-function -Wno-unused-variable -mno-cygwin -I/c/msys
/1.0/src/openssl-0.9.7l/include -I/c/msys/1.0/src/lzo-2.02/include -c 
base64.c -
o base64.o
In file included from base64.c:35:
config-win32.h:38:27: autodefs/defs.h: No such file or directory
make: *** [base64.o] Error 1

Config-win32.h is calling autodefs/defs.h.  But autodefs/defs.h is not 
present in the source tree.
#include "autodefs/defs.h" was not present in RC1 which build successfully.

Removing the the offending line from Config-win32.h coursed the build to 
fail later on:

C:\msys\1.0\src\openvpn-2.1_rc4>make -f makefile.w32
gcc -g -O2 -Wall -Wno-unused-function -Wno-unused-variable -mno-cygwin -I/c/msys
/1.0/src/openssl-0.9.7l/include -I/c/msys/1.0/src/lzo-2.02/include -c 
base64.c -
o base64.o
gcc -g -O2 -Wall -Wno-unused-function -Wno-unused-variable -mno-cygwin -I/c/msys
/1.0/src/openssl-0.9.7l/include -I/c/msys/1.0/src/lzo-2.02/include -c 
buffer.c -
o buffer.o
gcc -g -O2 -Wall -Wno-unused-function -Wno-unused-variable -mno-cygwin -I/c/msys
/1.0/src/openssl-0.9.7l/include -I/c/msys/1.0/src/lzo-2.02/include -c 
crypto.c -
o crypto.o
crypto.c: In function `get_cipher':
crypto.c:418: error: syntax error before "PRODUCT_NAME"
crypto.c:418: error: `PRODUCT_NAME' undeclared (first use in this function)
crypto.c:418: error: (Each undeclared identifier is reported only once
crypto.c:418: error: for each function it appears in.)
crypto.c: In function `get_md':
crypto.c:434: error: syntax error before "PRODUCT_NAME"
crypto.c:434: error: `PRODUCT_NAME' undeclared (first use in this function)
crypto.c: In function `init_key_type':
crypto.c:529: error: syntax error before "PRODUCT_NAME"
crypto.c:529: error: `PRODUCT_NAME' undeclared (first use in this function)
crypto.c: In function `test_crypto':
crypto.c:867: error: syntax error before "PRODUCT_NAME"
crypto.c:867: error: `PRODUCT_NAME' undeclared (first use in this function)
crypto.c:903: error: syntax error before string constant
crypto.c: In function `get_tls_handshake_key':
crypto.c:947: error: syntax error before "PRODUCT_NAME"
crypto.c:947: error: `PRODUCT_NAME' undeclared (first use in this function)
crypto.c: At top level:
crypto.c:994: error: syntax error before "PRODUCT_NAME"
crypto.c:995: error: syntax error before "PRODUCT_NAME"
crypto.c: In function `write_key_file':
crypto.c:1301: error: syntax error before "PRODUCT_NAME"
crypto.c: In function `must_have_n_keys':
crypto.c:1327: error: syntax error before "PRODUCT_UNIX_NAME"
crypto.c:1327: error: `PRODUCT_UNIX_NAME' undeclared (first use in this 
function
)
crypto.c: In function `show_available_ciphers':
crypto.c:1475: error: syntax error before "PRODUCT_NAME"
crypto.c: In function `show_available_digests':
crypto.c:1510: error: syntax error before "PRODUCT_NAME"
make: *** [crypto.o] Error 1

Can anybody explain what I''m missing and what's  why going wrong.

Regards,

John






____________________________________________
Openvpn-users mailing list
Openvpn-users@xxxxxxxxxxxxxxxxxxxxx
https://lists.sourceforge.net/lists/listinfo/openvpn-users